{"text_format":"1","workbook":"xlsx","n_sheets":4,"sheets":["matriz puntaje","matriz evaluación","comité evaluador","ranking acta"],"not_rendered":{"charts":0,"images":0,"macros":1,"external_links":2,"defined_names":0,"comments":0,"pivot_tables":0},"unopened":[],"bounds":{"document_bytes":16777216,"sheet_cells":100000,"rows_first":2000,"rows_last":500,"rows_between":2000,"halvings":0,"cell_chars":16384,"cell_head_chars":4096},"cells_cut":0,"cells_raw":0,"read":"whole","date_system":"1900"}

{"sheet":"matriz puntaje","index":0,"n_rows":20,"n_cols":4,"rows_kept":20,"cut":false,"hidden":false,"merged":[[15,0,19,0],[15,3,19,3],[11,0,14,0],[11,3,14,3],[0,0,0,3],[2,0,5,0],[2,3,5,3],[6,0,10,0],[6,3,10,3]]}
["FERIAS"]
["Criterio de Selección ","Clasificación","Puntaje","Ponderación"]
["Comité Evaluador","Muy buena",4,0.5]
[null,"Buena",3]
[null,"Suficiente",2]
[null,"Insuficiente",1]
["Permanencia Exportadora","Exportadora Continua (años 2017, 2018 y 2019)",5,0.25]
[null,"Exportadora Intermitente (al menos dos años entre 2017 y 2019)",4]
[null,"Nuevo exportador (solo año 2021)",3]
[null,"Exportador solo un año (año 2019 o 2020)",2]
[null,"Sin exportaciones",1]
["Tamaño empresa","Mediana",4,0.2]
[null,"Pequeña",3]
[null,"Micro",2]
[null,"Grande",1]
["Test de Gestión Sostenible","Puntaje total entre 9 y 12",5,0.05]
[null,"Puntaje total entre 5 y 8",4]
[null,"Puntaje total entre 1 y 4",3]
[null,"Puntaje total cero",2]
[null,"Sin test realizado",1]

{"sheet":"matriz evaluación","index":1,"n_rows":204,"n_cols":14,"rows_kept":204,"cut":false,"hidden":false,"merged":[[1,5,1,12],[2,13,3,13],[0,0,0,1],[1,0,3,0],[1,1,3,1],[1,2,3,2],[1,3,3,3],[1,4,3,4]]}
["PLANILLA EVALUACIÓN"]
["ID","Nombre del Postulante","Rut","Fecha de Postulación","Hora de Postulación","CRITERIOS DE SELECCIÓN"]
[null,null,null,null,null,"Criterio",0.2,"Criterio",0.25,"Criterio",0.05,"Criterio",0.5,"PUNTAJE FINAL"]
[null,null,null,null,null,"Tamaño Empresa","Puntaje","Permanencia Exportadora","Puntaje","Test de Gestión Sostenible","Puntaje",null,"Puntaje"]
[1,null,null,null,null,null,{"$f":"IFERROR(VLOOKUP(F5,'matriz puntaje'!$B$12:$C$15,2,FALSE),\"\")","v":""},null,{"$f":"IFERROR(VLOOKUP(H5,'matriz puntaje'!$B$7:$C$11,2,FALSE),\"\")","v":""},null,{"$f":"IFERROR(VLOOKUP(J5,'matriz puntaje'!$B$16:$C$20,2,FALSE),\"\")","v":""},{"$f":"IFERROR(VLOOKUP(A5,'comité evaluador'!$A$3:$P$202,16,FALSE),\"\")","v":""},{"$f":"L5","v":""},{"$f":"IFERROR((G5*$G$3+I5*$I$3+M5*$M$3+$K$3*K5),\"\")","v":""}]
[2,null,null,null,null,null,{"$f":"IFERROR(VLOOKUP(F6,'matriz puntaje'!$B$12:$C$15,2,FALSE),\"\")","v":""},null,{"$f":"IFERROR(VLOOKUP(H6,'matriz puntaje'!$B$7:$C$11,2,FALSE),\"\")","v":""},null,{"$f":"IFERROR(VLOOKUP(J6,'matriz puntaje'!$B$16:$C$20,2,FALSE),\"\")","v":""},{"$f":"IFERROR(VLOOKUP(A6,'comité evaluador'!$A$3:$P$202,16,FALSE),\"\")","v":""},{"$f":"L6","v":""},{"$f":"IFERROR((G6*$G$3+I6*$I$3+M6*$M$3+$K$3*K6),\"\")","v":""}]
[3,null,null,null,null,null,{"$f":"IFERROR(VLOOKUP(F7,'matriz puntaje'!$B$12:$C$15,2,FALSE),\"\")","v":""},null,{"$f":"IFERROR(VLOOKUP(H7,'matriz puntaje'!$B$7:$C$11,2,FALSE),\"\")","v":""},null,{"$f":"IFERROR(VLOOKUP(J7,'matriz puntaje'!$B$16:$C$20,2,FALSE),\"\")","v":""},{"$f":"IFERROR(VLOOKUP(A7,'comité evaluador'!$A$3:$P$202,16,FALSE),\"\")","v":""},"",""]
[4,null,null,null,null,null,{"$f":"IFERROR(VLOOKUP(F8,'matriz puntaje'!$B$12:$C$15,2,FALSE),\"\")","v":""},null,{"$f":"IFERROR(VLOOKUP(H8,'matriz puntaje'!$B$7:$C$11,2,FALSE),\"\")","v":""},null,{"$f":"IFERROR(VLOOKUP(J8,'matriz puntaje'!$B$16:$C$20,2,FALSE),\"\")","v":""},{"$f":"IFERROR(VLOOKUP(A8,'comité evaluador'!$A$3:$P$202,16,FALSE),\"\")","v":""},"",""]
[5,null,null,null,null,null,{"$f":"IFERROR(VLOOKUP(F9,'matriz puntaje'!$B$12:$C$15,2,FALSE),\"\")","v":""},null,{"$f":"IFERROR(VLOOKUP(H9,'matriz puntaje'!$B$7:$C$11,2,FALSE),\"\")","v":""},null,{"$f":"IFERROR(VLOOKUP(J9,'matriz puntaje'!$B$16:$C$20,2,FALSE),\"\")","v":""},{"$f":"IFERROR(VLOOKUP(A9,'comité evaluador'!$A$3:$P$202,16,FALSE),\"\")","v":""},"",""]
[6,null,null,null,null,null,{"$f":"IFERROR(VLOOKUP(F10,'matriz puntaje'!$B$12:$C$15,2,FALSE),\"\")","v":""},null,{"$f":"IFERROR(VLOOKUP(H10,'matriz puntaje'!$B$7:$C$11,2,FALSE),\"\")","v":""},null,{"$f":"IFERROR(VLOOKUP(J10,'matriz puntaje'!$B$16:$C$20,2,FALSE),\"\")","v":""},{"$f":"IFERROR(VLOOKUP(A10,'comité evaluador'!$A$3:$P$202,16,FALSE),\"\")","v":""},"",""]
[7,null,null,null,null,null,{"$f":"IFERROR(VLOOKUP(F11,'matriz puntaje'!$B$12:$C$15,2,FALSE),\"\")","v":""},null,{"$f":"IFERROR(VLOOKUP(H11,'matriz puntaje'!$B$7:$C$11,2,FALSE),\"\")","v":""},null,{"$f":"IFERROR(VLOOKUP(J11,'matriz puntaje'!$B$16:$C$20,2,FALSE),\"\")","v":""},{"$f":"IFERROR(VLOOKUP(A11,'comité evaluador'!$A$3:$P$202,16,FALSE),\"\")","v":""},"",""]
[8,null,null,null,null,null,{"$f":"IFERROR(VLOOKUP(F12,'matriz puntaje'!$B$12:$C$15,2,FALSE),\"\")","v":""},null,{"$f":"IFERROR(VLOOKUP(H12,'matriz puntaje'!$B$7:$C$11,2,FALSE),\"\")","v":""},null,{"$f":"IFERROR(VLOOKUP(J12,'matriz puntaje'!$B$16:$C$20,2,FALSE),\"\")","v":""},{"$f":"IFERROR(VLOOKUP(A12,'comité evaluador'!$A$3:$P$202,16,FALSE),\"\")","v":""},"",""]
[9,null,null,null,null,null,{"$f":"IFERROR(VLOOKUP(F13,'matriz puntaje'!$B$12:$C$15,2,FALSE),\"\")","v":""},null,{"$f":"IFERROR(VLOOKUP(H13,'matriz puntaje'!$B$7:$C$11,2,FALSE),\"\")","v":""},null,{"$f":"IFERROR(VLOOKUP(J13,'matriz puntaje'!$B$16:$C$20,2,FALSE),\"\")","v":""},{"$f":"IFERROR(VLOOKUP(A13,'comité evaluador'!$A$3:$P$202,16,FALSE),\"\")","v":""},"",""]
[10,null,null,null,null,null,{"$f":"IFERROR(VLOOKUP(F14,'matriz puntaje'!$B$12:$C$15,2,FALSE),\"\")","v":""},null,{"$f":"IFERROR(VLOOKUP(H14,'matriz puntaje'!$B$7:$C$11,2,FALSE),\"\")","v":""},null,{"$f":"IFERROR(VLOOKUP(J14,'matriz puntaje'!$B$16:$C$20,2,FALSE),\"\")","v":""},{"$f":"IFERROR(VLOOKUP(A14,'comité evaluador'!$A$3:$P$202,16,FALSE),\"\")","v":""},"",""]
[11,null,null,null,null,null,{"$f":"IFERROR(VLOOKUP(F15,'matriz puntaje'!$B$12:$C$15,2,FALSE),\"\")","v":""},null,{"$f":"IFERROR(VLOOKUP(H15,'matriz puntaje'!$B$7:$C$11,2,FALSE),\"\")","v":""},null,{"$f":"IFERROR(VLOOKUP(J15,'matriz puntaje'!$B$16:$C$20,2,FALSE),\"\")","v":""},{"$f":"IFERROR(VLOOKUP(A15,'comité evaluador'!$A$3:$P$202,16,FALSE),\"\")","v":""},"",""]
[12,null,null,null,null,null,{"$f":"IFERROR(VLOOKUP(F16,'matriz puntaje'!$B$12:$C$15,2,FALSE),\"\")","v":""},null,{"$f":"IFERROR(VLOOKUP(H16,'matriz puntaje'!$B$7:$C$11,2,FALSE),\"\")","v":""},null,{"$f":"IFERROR(VLOOKUP(J16,'matriz puntaje'!$B$16:$C$20,2,FALSE),\"\")","v":""},{"$f":"IFERROR(VLOOKUP(A16,'comité evaluador'!$A$3:$P$202,16,FALSE),\"\")","v":""},"",""]
[13,null,null,null,null,null,{"$f":"IFERROR(VLOOKUP(F17,'matriz puntaje'!$B$12:$C$15,2,FALSE),\"\")","v":""},null,{"$f":"IFERROR(VLOOKUP(H17,'matriz puntaje'!$B$7:$C$11,2,FALSE),\"\")","v":""},null,{"$f":"IFERROR(VLOOKUP(J17,'matriz puntaje'!$B$16:$C$20,2,FALSE),\"\")","v":""},{"$f":"IFERROR(VLOOKUP(A17,'comité evaluador'!$A$3:$P$202,16,FALSE),\"\")","v":""},"",""]
[14,null,null,null,null,null,{"$f":"IFERROR(VLOOKUP(F18,'matriz puntaje'!$B$12:$C$15,2,FALSE),\"\")","v":""},null,{"$f":"IFERROR(VLOOKUP(H18,'matriz puntaje'!$B$7:$C$11,2,FALSE),\"\")","v":""},null,{"$f":"IFERROR(VLOOKUP(J18,'matriz puntaje'!$B$16:$C$20,2,FALSE),\"\")","v":""},{"$f":"IFERROR(VLOOKUP(A18,'comité evaluador'!$A$3:$P$202,16,FALSE),\"\")","v":""},"",""]
[15,null,null,null,null,null,{"$f":"IFERROR(VLOOKUP(F19,'matriz puntaje'!$B$12:$C$15,2,FALSE),\"\")","v":""},null,{"$f":"IFERROR(VLOOKUP(H19,'matriz puntaje'!$B$7:$C$11,2,FALSE),\"\")","v":""},null,{"$f":"IFERROR(VLOOKUP(J19,'matriz puntaje'!$B$16:$C$20,2,FALSE),\"\")","v":""},{"$f":"IFERROR(VLOOKUP(A19,'comité evaluador'!$A$3:$P$202,16,FALSE),\"\")","v":""},"",""]
[16,null,null,null,null,null,{"$f":"IFERROR(VLOOKUP(F20,'matriz puntaje'!$B$12:$C$15,2,FALSE),\"\")","v":""},null,{"$f":"IFERROR(VLOOKUP(H20,'matriz puntaje'!$B$7:$C$11,2,FALSE),\"\")","v":""},null,{"$f":"IFERROR(VLOOKUP(J20,'matriz puntaje'!$B$16:$C$20,2,FALSE),\"\")","v":""},{"$f":"IFERROR(VLOOKUP(A20,'comité evaluador'!$A$3:$P$202,16,FALSE),\"\")","v":""},"",""]
[17,null,null,null,null,null,{"$f":"IFERROR(VLOOKUP(F21,'matriz puntaje'!$B$12:$C$15,2,FALSE),\"\")","v":""},null,{"$f":"IFERROR(VLOOKUP(H21,'matriz puntaje'!$B$7:$C$11,2,FALSE),\"\")","v":""},null,{"$f":"IFERROR(VLOOKUP(J21,'matriz puntaje'!$B$16:$C$20,2,FALSE),\"\")","v":""},{"$f":"IFERROR(VLOOKUP(A21,'comité evaluador'!$A$3:$P$202,16,FALSE),\"\")","v":""},"",""]
[18,null,null,null,null,null,{"$f":"IFERROR(VLOOKUP(F22,'matriz puntaje'!$B$12:$C$15,2,FALSE),\"\")","v":""},null,{"$f":"IFERROR(VLOOKUP(H22,'matriz puntaje'!$B$7:$C$11,2,FALSE),\"\")","v":""},null,{"$f":"IFERROR(VLOOKUP(J22,'matriz puntaje'!$B$16:$C$20,2,FALSE),\"\")","v":""},{"$f":"IFERROR(VLOOKUP(A22,'comité evaluador'!$A$3:$P$202,16,FALSE),\"\")","v":""},"",""]
[19,null,null,null,null,null,{"$f":"IFERROR(VLOOKUP(F23,'matriz puntaje'!$B$12:$C$15,2,FALSE),\"\")","v":""},null,{"$f":"IFERROR(VLOOKUP(H23,'matriz puntaje'!$B$7:$C$11,2,FALSE),\"\")","v":""},null,{"$f":"IFERROR(VLOOKUP(J23,'matriz puntaje'!$B$16:$C$20,2,FALSE),\"\")","v":""},{"$f":"IFERROR(VLOOKUP(A23,'comité evaluador'!$A$3:$P$202,16,FALSE),\"\")","v":""},"",""]
[20,null,null,null,null,null,{"$f":"IFERROR(VLOOKUP(F24,'matriz puntaje'!$B$12:$C$15,2,FALSE),\"\")","v":""},null,{"$f":"IFERROR(VLOOKUP(H24,'matriz puntaje'!$B$7:$C$11,2,FALSE),\"\")","v":""},null,{"$f":"IFERROR(VLOOKUP(J24,'matriz puntaje'!$B$16:$C$20,2,FALSE),\"\")","v":""},{"$f":"IFERROR(VLOOKUP(A24,'comité evaluador'!$A$3:$P$202,16,FALSE),\"\")","v":""},"",""]
[21,null,null,null,null,null,{"$f":"IFERROR(VLOOKUP(F25,'matriz puntaje'!$B$12:$C$15,2,FALSE),\"\")","v":""},null,{"$f":"IFERROR(VLOOKUP(H25,'matriz puntaje'!$B$7:$C$11,2,FALSE),\"\")","v":""},null,{"$f":"IFERROR(VLOOKUP(J25,'matriz puntaje'!$B$16:$C$20,2,FALSE),\"\")","v":""},{"$f":"IFERROR(VLOOKUP(A25,'comité evaluador'!$A$3:$P$202,16,FALSE),\"\")","v":""},"",""]
[22,null,null,null,null,null,{"$f":"IFERROR(VLOOKUP(F26,'matriz puntaje'!$B$12:$C$15,2,FALSE),\"\")","v":""},null,{"$f":"IFERROR(VLOOKUP(H26,'matriz puntaje'!$B$7:$C$11,2,FALSE),\"\")","v":""},null,{"$f":"IFERROR(VLOOKUP(J26,'matriz puntaje'!$B$16:$C$20,2,FALSE),\"\")","v":""},{"$f":"IFERROR(VLOOKUP(A26,'comité evaluador'!$A$3:$P$202,16,FALSE),\"\")","v":""},"",""]
[23,null,null,null,null,null,{"$f":"IFERROR(VLOOKUP(F27,'matriz puntaje'!$B$12:$C$15,2,FALSE),\"\")","v":""},null,{"$f":"IFERROR(VLOOKUP(H27,'matriz puntaje'!$B$7:$C$11,2,FALSE),\"\")","v":""},null,{"$f":"IFERROR(VLOOKUP(J27,'matriz puntaje'!$B$16:$C$20,2,FALSE),\"\")","v":""},{"$f":"IFERROR(VLOOKUP(A27,'comité evaluador'!$A$3:$P$202,16,FALSE),\"\")","v":""},"",""]
[24,null,null,null,null,null,{"$f":"IFERROR(VLOOKUP(F28,'matriz puntaje'!$B$12:$C$15,2,FALSE),\"\")","v":""},null,{"$f":"IFERROR(VLOOKUP(H28,'matriz puntaje'!$B$7:$C$11,2,FALSE),\"\")","v":""},null,{"$f":"IFERROR(VLOOKUP(J28,'matriz puntaje'!$B$16:$C$20,2,FALSE),\"\")","v":""},{"$f":"IFERROR(VLOOKUP(A28,'comité evaluador'!$A$3:$P$202,16,FALSE),\"\")","v":""},"",""]
[25,null,null,null,null,null,{"$f":"IFERROR(VLOOKUP(F29,'matriz puntaje'!$B$12:$C$15,2,FALSE),\"\")","v":""},null,{"$f":"IFERROR(VLOOKUP(H29,'matriz puntaje'!$B$7:$C$11,2,FALSE),\"\")","v":""},null,{"$f":"IFERROR(VLOOKUP(J29,'matriz puntaje'!$B$16:$C$20,2,FALSE),\"\")","v":""},{"$f":"IFERROR(VLOOKUP(A29,'comité evaluador'!$A$3:$P$202,16,FALSE),\"\")","v":""},"",""]
[26,null,null,null,null,null,{"$f":"IFERROR(VLOOKUP(F30,'matriz puntaje'!$B$12:$C$15,2,FALSE),\"\")","v":""},null,{"$f":"IFERROR(VLOOKUP(H30,'matriz puntaje'!$B$7:$C$11,2,FALSE),\"\")","v":""},null,{"$f":"IFERROR(VLOOKUP(J30,'matriz puntaje'!$B$16:$C$20,2,FALSE),\"\")","v":""},{"$f":"IFERROR(VLOOKUP(A30,'comité evaluador'!$A$3:$P$202,16,FALSE),\"\")","v":""},"",""]
{"$rows_left_out":175}
{"sheet":"comité evaluador","index":2,"n_rows":202,"n_cols":16,"rows_kept":202,"cut":false,"hidden":false,"merged":[[0,11,0,14],[0,0,1,0],[0,1,1,1],[0,2,1,2],[0,3,0,6],[0,7,0,10]]}
["ID","Rut","Postulante","EVALUACIÓN OFIREG",null,null,null,"EVALUACIÓN OFICOM",null,null,null,"EVALUACIÓN SECTOR"]
[null,null,null,"Experiencia y Comportamiento de trabajo con ProChile","Puntaje","Razón Argumento","Nota Final OFIREG","Oportunidad de mercado","Puntaje","Razón Argumento","Nota Final OFICOM","Potencialidad de la oferta ","Puntaje","Razón Argumento","Nota Final SECTOR","NOTA FINAL"]
[1,{"$f":"IFERROR(VLOOKUP(A3,'matriz evaluación'!$A$5:$C$204,2,FALSE),\"\")","v":0},{"$f":"IFERROR(VLOOKUP(A3,'matriz evaluación'!$A$5:$C$204,3,FALSE),\"\")","v":0},null,{"$f":"IFERROR(VLOOKUP(D3,'matriz puntaje'!$B$3:$C$6,2,FALSE),\"\")","v":""},"Ingrese el argumento de la evaluación…",{"$f":"E3","v":""},null,{"$f":"IFERROR(VLOOKUP(H3,'matriz puntaje'!$B$3:$C$6,2,FALSE),\"\")","v":""},"Ingrese el argumento de la evaluación…",{"$f":"I3","v":""},null,{"$f":"IFERROR(VLOOKUP(L3,'matriz puntaje'!$B$3:$C$6,2,FALSE),\"\")","v":""},"Ingrese el argumento de la evaluación…",{"$f":"M3","v":""},{"$f":"IFERROR(AVERAGE(G3,K3,O3),\"\")","v":""}]
[2,{"$f":"IFERROR(VLOOKUP(A4,'matriz evaluación'!$A$5:$C$204,2,FALSE),\"\")","v":0},{"$f":"IFERROR(VLOOKUP(A4,'matriz evaluación'!$A$5:$C$204,3,FALSE),\"\")","v":0},null,{"$f":"IFERROR(VLOOKUP(D4,'matriz puntaje'!$B$3:$C$6,2,FALSE),\"\")","v":""},null,{"$f":"E4","v":""},null,{"$f":"IFERROR(VLOOKUP(H4,'matriz puntaje'!$B$3:$C$6,2,FALSE),\"\")","v":""},null,{"$f":"I4","v":""},null,{"$f":"IFERROR(VLOOKUP(L4,'matriz puntaje'!$B$3:$C$6,2,FALSE),\"\")","v":""},null,{"$f":"M4","v":""},""]
[3,{"$f":"IFERROR(VLOOKUP(A5,'matriz evaluación'!$A$5:$C$204,2,FALSE),\"\")","v":0},{"$f":"IFERROR(VLOOKUP(A5,'matriz evaluación'!$A$5:$C$204,3,FALSE),\"\")","v":0},null,{"$f":"IFERROR(VLOOKUP(D5,'matriz puntaje'!$B$3:$C$6,2,FALSE),\"\")","v":""},null,"",null,{"$f":"IFERROR(VLOOKUP(H5,'matriz puntaje'!$B$3:$C$6,2,FALSE),\"\")","v":""},null,"",null,{"$f":"IFERROR(VLOOKUP(L5,'matriz puntaje'!$B$3:$C$6,2,FALSE),\"\")","v":""},null,"",""]
[4,{"$f":"IFERROR(VLOOKUP(A6,'matriz evaluación'!$A$5:$C$204,2,FALSE),\"\")","v":0},{"$f":"IFERROR(VLOOKUP(A6,'matriz evaluación'!$A$5:$C$204,3,FALSE),\"\")","v":0},null,{"$f":"IFERROR(VLOOKUP(D6,'matriz puntaje'!$B$3:$C$6,2,FALSE),\"\")","v":""},null,"",null,{"$f":"IFERROR(VLOOKUP(H6,'matriz puntaje'!$B$3:$C$6,2,FALSE),\"\")","v":""},null,"",null,{"$f":"IFERROR(VLOOKUP(L6,'matriz puntaje'!$B$3:$C$6,2,FALSE),\"\")","v":""},null,"",""]
[5,{"$f":"IFERROR(VLOOKUP(A7,'matriz evaluación'!$A$5:$C$204,2,FALSE),\"\")","v":0},{"$f":"IFERROR(VLOOKUP(A7,'matriz evaluación'!$A$5:$C$204,3,FALSE),\"\")","v":0},null,{"$f":"IFERROR(VLOOKUP(D7,'matriz puntaje'!$B$3:$C$6,2,FALSE),\"\")","v":""},null,"",null,{"$f":"IFERROR(VLOOKUP(H7,'matriz puntaje'!$B$3:$C$6,2,FALSE),\"\")","v":""},null,"",null,{"$f":"IFERROR(VLOOKUP(L7,'matriz puntaje'!$B$3:$C$6,2,FALSE),\"\")","v":""},null,"",""]
[6,{"$f":"IFERROR(VLOOKUP(A8,'matriz evaluación'!$A$5:$C$204,2,FALSE),\"\")","v":0},{"$f":"IFERROR(VLOOKUP(A8,'matriz evaluación'!$A$5:$C$204,3,FALSE),\"\")","v":0},null,{"$f":"IFERROR(VLOOKUP(D8,'matriz puntaje'!$B$3:$C$6,2,FALSE),\"\")","v":""},null,"",null,{"$f":"IFERROR(VLOOKUP(H8,'matriz puntaje'!$B$3:$C$6,2,FALSE),\"\")","v":""},null,"",null,{"$f":"IFERROR(VLOOKUP(L8,'matriz puntaje'!$B$3:$C$6,2,FALSE),\"\")","v":""},null,"",""]
[7,{"$f":"IFERROR(VLOOKUP(A9,'matriz evaluación'!$A$5:$C$204,2,FALSE),\"\")","v":0},{"$f":"IFERROR(VLOOKUP(A9,'matriz evaluación'!$A$5:$C$204,3,FALSE),\"\")","v":0},null,{"$f":"IFERROR(VLOOKUP(D9,'matriz puntaje'!$B$3:$C$6,2,FALSE),\"\")","v":""},null,"",null,{"$f":"IFERROR(VLOOKUP(H9,'matriz puntaje'!$B$3:$C$6,2,FALSE),\"\")","v":""},null,"",null,{"$f":"IFERROR(VLOOKUP(L9,'matriz puntaje'!$B$3:$C$6,2,FALSE),\"\")","v":""},null,"",""]
[8,{"$f":"IFERROR(VLOOKUP(A10,'matriz evaluación'!$A$5:$C$204,2,FALSE),\"\")","v":0},{"$f":"IFERROR(VLOOKUP(A10,'matriz evaluación'!$A$5:$C$204,3,FALSE),\"\")","v":0},null,{"$f":"IFERROR(VLOOKUP(D10,'matriz puntaje'!$B$3:$C$6,2,FALSE),\"\")","v":""},null,"",null,{"$f":"IFERROR(VLOOKUP(H10,'matriz puntaje'!$B$3:$C$6,2,FALSE),\"\")","v":""},null,"",null,{"$f":"IFERROR(VLOOKUP(L10,'matriz puntaje'!$B$3:$C$6,2,FALSE),\"\")","v":""},null,"",""]
[9,{"$f":"IFERROR(VLOOKUP(A11,'matriz evaluación'!$A$5:$C$204,2,FALSE),\"\")","v":0},{"$f":"IFERROR(VLOOKUP(A11,'matriz evaluación'!$A$5:$C$204,3,FALSE),\"\")","v":0},null,{"$f":"IFERROR(VLOOKUP(D11,'matriz puntaje'!$B$3:$C$6,2,FALSE),\"\")","v":""},null,"",null,{"$f":"IFERROR(VLOOKUP(H11,'matriz puntaje'!$B$3:$C$6,2,FALSE),\"\")","v":""},null,"",null,{"$f":"IFERROR(VLOOKUP(L11,'matriz puntaje'!$B$3:$C$6,2,FALSE),\"\")","v":""},null,"",""]
[10,{"$f":"IFERROR(VLOOKUP(A12,'matriz evaluación'!$A$5:$C$204,2,FALSE),\"\")","v":0},{"$f":"IFERROR(VLOOKUP(A12,'matriz evaluación'!$A$5:$C$204,3,FALSE),\"\")","v":0},null,{"$f":"IFERROR(VLOOKUP(D12,'matriz puntaje'!$B$3:$C$6,2,FALSE),\"\")","v":""},null,"",null,{"$f":"IFERROR(VLOOKUP(H12,'matriz puntaje'!$B$3:$C$6,2,FALSE),\"\")","v":""},null,"",null,{"$f":"IFERROR(VLOOKUP(L12,'matriz puntaje'!$B$3:$C$6,2,FALSE),\"\")","v":""},null,"",""]
[11,{"$f":"IFERROR(VLOOKUP(A13,'matriz evaluación'!$A$5:$C$204,2,FALSE),\"\")","v":0},{"$f":"IFERROR(VLOOKUP(A13,'matriz evaluación'!$A$5:$C$204,3,FALSE),\"\")","v":0},null,{"$f":"IFERROR(VLOOKUP(D13,'matriz puntaje'!$B$3:$C$6,2,FALSE),\"\")","v":""},null,"",null,{"$f":"IFERROR(VLOOKUP(H13,'matriz puntaje'!$B$3:$C$6,2,FALSE),\"\")","v":""},null,"",null,{"$f":"IFERROR(VLOOKUP(L13,'matriz puntaje'!$B$3:$C$6,2,FALSE),\"\")","v":""},null,"",""]
[12,{"$f":"IFERROR(VLOOKUP(A14,'matriz evaluación'!$A$5:$C$204,2,FALSE),\"\")","v":0},{"$f":"IFERROR(VLOOKUP(A14,'matriz evaluación'!$A$5:$C$204,3,FALSE),\"\")","v":0},null,{"$f":"IFERROR(VLOOKUP(D14,'matriz puntaje'!$B$3:$C$6,2,FALSE),\"\")","v":""},null,"",null,{"$f":"IFERROR(VLOOKUP(H14,'matriz puntaje'!$B$3:$C$6,2,FALSE),\"\")","v":""},null,"",null,{"$f":"IFERROR(VLOOKUP(L14,'matriz puntaje'!$B$3:$C$6,2,FALSE),\"\")","v":""},null,"",""]
[13,{"$f":"IFERROR(VLOOKUP(A15,'matriz evaluación'!$A$5:$C$204,2,FALSE),\"\")","v":0},{"$f":"IFERROR(VLOOKUP(A15,'matriz evaluación'!$A$5:$C$204,3,FALSE),\"\")","v":0},null,{"$f":"IFERROR(VLOOKUP(D15,'matriz puntaje'!$B$3:$C$6,2,FALSE),\"\")","v":""},null,"",null,{"$f":"IFERROR(VLOOKUP(H15,'matriz puntaje'!$B$3:$C$6,2,FALSE),\"\")","v":""},null,"",null,{"$f":"IFERROR(VLOOKUP(L15,'matriz puntaje'!$B$3:$C$6,2,FALSE),\"\")","v":""},null,"",""]
[14,{"$f":"IFERROR(VLOOKUP(A16,'matriz evaluación'!$A$5:$C$204,2,FALSE),\"\")","v":0},{"$f":"IFERROR(VLOOKUP(A16,'matriz evaluación'!$A$5:$C$204,3,FALSE),\"\")","v":0},null,{"$f":"IFERROR(VLOOKUP(D16,'matriz puntaje'!$B$3:$C$6,2,FALSE),\"\")","v":""},null,"",null,{"$f":"IFERROR(VLOOKUP(H16,'matriz puntaje'!$B$3:$C$6,2,FALSE),\"\")","v":""},null,"",null,{"$f":"IFERROR(VLOOKUP(L16,'matriz puntaje'!$B$3:$C$6,2,FALSE),\"\")","v":""},null,"",""]
[15,{"$f":"IFERROR(VLOOKUP(A17,'matriz evaluación'!$A$5:$C$204,2,FALSE),\"\")","v":0},{"$f":"IFERROR(VLOOKUP(A17,'matriz evaluación'!$A$5:$C$204,3,FALSE),\"\")","v":0},null,{"$f":"IFERROR(VLOOKUP(D17,'matriz puntaje'!$B$3:$C$6,2,FALSE),\"\")","v":""},null,"",null,{"$f":"IFERROR(VLOOKUP(H17,'matriz puntaje'!$B$3:$C$6,2,FALSE),\"\")","v":""},null,"",null,{"$f":"IFERROR(VLOOKUP(L17,'matriz puntaje'!$B$3:$C$6,2,FALSE),\"\")","v":""},null,"",""]
[16,{"$f":"IFERROR(VLOOKUP(A18,'matriz evaluación'!$A$5:$C$204,2,FALSE),\"\")","v":0},{"$f":"IFERROR(VLOOKUP(A18,'matriz evaluación'!$A$5:$C$204,3,FALSE),\"\")","v":0},null,{"$f":"IFERROR(VLOOKUP(D18,'matriz puntaje'!$B$3:$C$6,2,FALSE),\"\")","v":""},null,"",null,{"$f":"IFERROR(VLOOKUP(H18,'matriz puntaje'!$B$3:$C$6,2,FALSE),\"\")","v":""},null,"",null,{"$f":"IFERROR(VLOOKUP(L18,'matriz puntaje'!$B$3:$C$6,2,FALSE),\"\")","v":""},null,"",""]
[17,{"$f":"IFERROR(VLOOKUP(A19,'matriz evaluación'!$A$5:$C$204,2,FALSE),\"\")","v":0},{"$f":"IFERROR(VLOOKUP(A19,'matriz evaluación'!$A$5:$C$204,3,FALSE),\"\")","v":0},null,{"$f":"IFERROR(VLOOKUP(D19,'matriz puntaje'!$B$3:$C$6,2,FALSE),\"\")","v":""},null,"",null,{"$f":"IFERROR(VLOOKUP(H19,'matriz puntaje'!$B$3:$C$6,2,FALSE),\"\")","v":""},null,"",null,{"$f":"IFERROR(VLOOKUP(L19,'matriz puntaje'!$B$3:$C$6,2,FALSE),\"\")","v":""},null,"",""]
[18,{"$f":"IFERROR(VLOOKUP(A20,'matriz evaluación'!$A$5:$C$204,2,FALSE),\"\")","v":0},{"$f":"IFERROR(VLOOKUP(A20,'matriz evaluación'!$A$5:$C$204,3,FALSE),\"\")","v":0},null,{"$f":"IFERROR(VLOOKUP(D20,'matriz puntaje'!$B$3:$C$6,2,FALSE),\"\")","v":""},null,"",null,{"$f":"IFERROR(VLOOKUP(H20,'matriz puntaje'!$B$3:$C$6,2,FALSE),\"\")","v":""},null,"",null,{"$f":"IFERROR(VLOOKUP(L20,'matriz puntaje'!$B$3:$C$6,2,FALSE),\"\")","v":""},null,"",""]
[19,{"$f":"IFERROR(VLOOKUP(A21,'matriz evaluación'!$A$5:$C$204,2,FALSE),\"\")","v":0},{"$f":"IFERROR(VLOOKUP(A21,'matriz evaluación'!$A$5:$C$204,3,FALSE),\"\")","v":0},null,{"$f":"IFERROR(VLOOKUP(D21,'matriz puntaje'!$B$3:$C$6,2,FALSE),\"\")","v":""},null,"",null,{"$f":"IFERROR(VLOOKUP(H21,'matriz puntaje'!$B$3:$C$6,2,FALSE),\"\")","v":""},null,"",null,{"$f":"IFERROR(VLOOKUP(L21,'matriz puntaje'!$B$3:$C$6,2,FALSE),\"\")","v":""},null,"",""]
[20,{"$f":"IFERROR(VLOOKUP(A22,'matriz evaluación'!$A$5:$C$204,2,FALSE),\"\")","v":0},{"$f":"IFERROR(VLOOKUP(A22,'matriz evaluación'!$A$5:$C$204,3,FALSE),\"\")","v":0},null,{"$f":"IFERROR(VLOOKUP(D22,'matriz puntaje'!$B$3:$C$6,2,FALSE),\"\")","v":""},null,"",null,{"$f":"IFERROR(VLOOKUP(H22,'matriz puntaje'!$B$3:$C$6,2,FALSE),\"\")","v":""},null,"",null,{"$f":"IFERROR(VLOOKUP(L22,'matriz puntaje'!$B$3:$C$6,2,FALSE),\"\")","v":""},null,"",""]
[21,{"$f":"IFERROR(VLOOKUP(A23,'matriz evaluación'!$A$5:$C$204,2,FALSE),\"\")","v":0},{"$f":"IFERROR(VLOOKUP(A23,'matriz evaluación'!$A$5:$C$204,3,FALSE),\"\")","v":0},null,{"$f":"IFERROR(VLOOKUP(D23,'matriz puntaje'!$B$3:$C$6,2,FALSE),\"\")","v":""},null,"",null,{"$f":"IFERROR(VLOOKUP(H23,'matriz puntaje'!$B$3:$C$6,2,FALSE),\"\")","v":""},null,"",null,{"$f":"IFERROR(VLOOKUP(L23,'matriz puntaje'!$B$3:$C$6,2,FALSE),\"\")","v":""},null,"",""]
[22,{"$f":"IFERROR(VLOOKUP(A24,'matriz evaluación'!$A$5:$C$204,2,FALSE),\"\")","v":0},{"$f":"IFERROR(VLOOKUP(A24,'matriz evaluación'!$A$5:$C$204,3,FALSE),\"\")","v":0},null,{"$f":"IFERROR(VLOOKUP(D24,'matriz puntaje'!$B$3:$C$6,2,FALSE),\"\")","v":""},null,"",null,{"$f":"IFERROR(VLOOKUP(H24,'matriz puntaje'!$B$3:$C$6,2,FALSE),\"\")","v":""},null,"",null,{"$f":"IFERROR(VLOOKUP(L24,'matriz puntaje'!$B$3:$C$6,2,FALSE),\"\")","v":""},null,"",""]
[23,{"$f":"IFERROR(VLOOKUP(A25,'matriz evaluación'!$A$5:$C$204,2,FALSE),\"\")","v":0},{"$f":"IFERROR(VLOOKUP(A25,'matriz evaluación'!$A$5:$C$204,3,FALSE),\"\")","v":0},null,{"$f":"IFERROR(VLOOKUP(D25,'matriz puntaje'!$B$3:$C$6,2,FALSE),\"\")","v":""},null,"",null,{"$f":"IFERROR(VLOOKUP(H25,'matriz puntaje'!$B$3:$C$6,2,FALSE),\"\")","v":""},null,"",null,{"$f":"IFERROR(VLOOKUP(L25,'matriz puntaje'!$B$3:$C$6,2,FALSE),\"\")","v":""},null,"",""]
[24,{"$f":"IFERROR(VLOOKUP(A26,'matriz evaluación'!$A$5:$C$204,2,FALSE),\"\")","v":0},{"$f":"IFERROR(VLOOKUP(A26,'matriz evaluación'!$A$5:$C$204,3,FALSE),\"\")","v":0},null,{"$f":"IFERROR(VLOOKUP(D26,'matriz puntaje'!$B$3:$C$6,2,FALSE),\"\")","v":""},null,"",null,{"$f":"IFERROR(VLOOKUP(H26,'matriz puntaje'!$B$3:$C$6,2,FALSE),\"\")","v":""},null,"",null,{"$f":"IFERROR(VLOOKUP(L26,'matriz puntaje'!$B$3:$C$6,2,FALSE),\"\")","v":""},null,"",""]
[25,{"$f":"IFERROR(VLOOKUP(A27,'matriz evaluación'!$A$5:$C$204,2,FALSE),\"\")","v":0},{"$f":"IFERROR(VLOOKUP(A27,'matriz evaluación'!$A$5:$C$204,3,FALSE),\"\")","v":0},null,{"$f":"IFERROR(VLOOKUP(D27,'matriz puntaje'!$B$3:$C$6,2,FALSE),\"\")","v":""},null,"",null,{"$f":"IFERROR(VLOOKUP(H27,'matriz puntaje'!$B$3:$C$6,2,FALSE),\"\")","v":""},null,"",null,{"$f":"IFERROR(VLOOKUP(L27,'matriz puntaje'!$B$3:$C$6,2,FALSE),\"\")","v":""},null,"",""]
[26,{"$f":"IFERROR(VLOOKUP(A28,'matriz evaluación'!$A$5:$C$204,2,FALSE),\"\")","v":0},{"$f":"IFERROR(VLOOKUP(A28,'matriz evaluación'!$A$5:$C$204,3,FALSE),\"\")","v":0},null,{"$f":"IFERROR(VLOOKUP(D28,'matriz puntaje'!$B$3:$C$6,2,FALSE),\"\")","v":""},null,"",null,{"$f":"IFERROR(VLOOKUP(H28,'matriz puntaje'!$B$3:$C$6,2,FALSE),\"\")","v":""},null,"",null,{"$f":"IFERROR(VLOOKUP(L28,'matriz puntaje'!$B$3:$C$6,2,FALSE),\"\")","v":""},null,"",""]
[27,{"$f":"IFERROR(VLOOKUP(A29,'matriz evaluación'!$A$5:$C$204,2,FALSE),\"\")","v":0},{"$f":"IFERROR(VLOOKUP(A29,'matriz evaluación'!$A$5:$C$204,3,FALSE),\"\")","v":0},null,{"$f":"IFERROR(VLOOKUP(D29,'matriz puntaje'!$B$3:$C$6,2,FALSE),\"\")","v":""},null,"",null,{"$f":"IFERROR(VLOOKUP(H29,'matriz puntaje'!$B$3:$C$6,2,FALSE),\"\")","v":""},null,"",null,{"$f":"IFERROR(VLOOKUP(L29,'matriz puntaje'!$B$3:$C$6,2,FALSE),\"\")","v":""},null,"",""]
[28,{"$f":"IFERROR(VLOOKUP(A30,'matriz evaluación'!$A$5:$C$204,2,FALSE),\"\")","v":0},{"$f":"IFERROR(VLOOKUP(A30,'matriz evaluación'!$A$5:$C$204,3,FALSE),\"\")","v":0},null,{"$f":"IFERROR(VLOOKUP(D30,'matriz puntaje'!$B$3:$C$6,2,FALSE),\"\")","v":""},null,"",null,{"$f":"IFERROR(VLOOKUP(H30,'matriz puntaje'!$B$3:$C$6,2,FALSE),\"\")","v":""},null,"",null,{"$f":"IFERROR(VLOOKUP(L30,'matriz puntaje'!$B$3:$C$6,2,FALSE),\"\")","v":""},null,"",""]
{"$rows_left_out":173}
{"sheet":"ranking acta","index":3,"n_rows":202,"n_cols":6,"rows_kept":202,"cut":false,"hidden":false,"merged":[[0,0,0,5]]}
["RANKING FINAL DE NOTAS"]
["N°","Puntaje","Postulante","Rut","Fecha de Postulación","Hora de Postulación"]
[1,""]
[2,""]
[3,""]
[4,""]
[5,""]
[6,""]
[7,""]
[8,""]
[9,""]
[10,""]
[11,""]
[12,""]
[13,""]
[14,""]
[15,""]
[16,""]
[17,""]
[18,""]
[19,""]
[20,""]
[21,""]
[22,""]
[23,""]
[24,""]
[25,""]
[26,""]
[27,""]
[28,""]
{"$rows_left_out":172}